Target
Prothrombin
Ligand
BDBM50072291
Substrate
Meas. Tech.
ChEBML_207958
IC50
16800±n/a nM
Citation
 Finch, HPegg, NAMcLaren, JLowdon, ABolton, RCoote, SJDyer, UMontana, JGOwen, MRDowle, MBuckley, DRoss, BCCampbell, CDix, CMooney, CMan-Tang, CPatel, C 5,5-trans lactone-containing inhibitors of serine proteases: identification of a novel, acylating thrombin inhibitor. Bioorg Med Chem Lett 8:2955-60 (1999)  
Target
Name:
Prothrombin
Synonyms:
Activation peptide fragment 1 Coagulation factor II Prothrombin precursor Thrombin heavy chain | Thrombin light chain
Type:
Protein
Mol. Mass.:
70029.57
Organism:
Homo sapiens (Human)
Description:
P00734
Residue:
622
  
Inhibitor
Name:
BDBM50072291
Synonyms:
4-((3R,3aR,6aS)-2-Oxo-hexahydro-cyclopenta[b]furan-3-ylmethyl)-benzamidine; compound with acetic acid | CHEMBL323544
Type:
Small organic molecule
Emp. Form.:
C15H18N2O2
Mol. Mass.:
258.3156
SMILES:
NC(=N)c1ccc(C[C@@H]2[C@H]3CCC[C@@H]3OC2=O)cc1
: