Target
Serine protease 1
Ligand
BDBM50072288
Substrate
Meas. Tech.
ChEBML_212695
IC50
3300±n/a nM
Citation
 Finch, HPegg, NAMcLaren, JLowdon, ABolton, RCoote, SJDyer, UMontana, JGOwen, MRDowle, MBuckley, DRoss, BCCampbell, CDix, CMooney, CMan-Tang, CPatel, C 5,5-trans lactone-containing inhibitors of serine proteases: identification of a novel, acylating thrombin inhibitor. Bioorg Med Chem Lett 8:2955-60 (1999)  
Target
Name:
Serine protease 1
Synonyms:
Alpha-trypsin chain 1 Beta-trypsin PRSS1 TRP1 TRY1_HUMAN Thrombin & trypsin Trypsin I | Trypsin-1
Type:
Enzyme
Mol. Mass.:
26557.80
Organism:
Homo sapiens (Human)
Description:
P07477
Residue:
247
  
Inhibitor
Name:
BDBM50072288
Synonyms:
3-((3R,3aR,6aS)-2-Oxo-hexahydro-cyclopenta[b]furan-3-ylmethyl)-benzamidine; compound with acetic acid | CHEMBL102134
Type:
Small organic molecule
Emp. Form.:
C15H18N2O2
Mol. Mass.:
258.3156
SMILES:
NC(=N)c1cccc(C[C@@H]2[C@H]3CCC[C@@H]3OC2=O)c1
: