Target
Chymotrypsin-C
Ligand
BDBM50072293
Substrate
Meas. Tech.
ChEBML_49751
IC50
>100000±n/a nM
Citation
 Finch, HPegg, NAMcLaren, JLowdon, ABolton, RCoote, SJDyer, UMontana, JGOwen, MRDowle, MBuckley, DRoss, BCCampbell, CDix, CMooney, CMan-Tang, CPatel, C 5,5-trans lactone-containing inhibitors of serine proteases: identification of a novel, acylating thrombin inhibitor. Bioorg Med Chem Lett 8:2955-60 (1999)  
Target
Name:
Chymotrypsin-C
Synonyms:
CLCR CTRC_HUMAN Chymotrypsin Chymotrypsin-C
Type:
Enzyme
Mol. Mass.:
29487.98
Organism:
Homo sapiens (Human)
Description:
Q99895
Residue:
268
  
Inhibitor
Name:
BDBM50072293
Synonyms:
5-((3R,3aR,6aS)-2-Oxo-hexahydro-cyclopenta[b]furan-3-yl)-pentanamidine; compound with acetic acid CHEMBL337572
Type:
Small organic molecule
Emp. Form.:
C12H20N2O2
Mol. Mass.:
224.2994
SMILES:
NC(=N)CCCC[C@@H]1[C@H]2CCC[C@@H]2OC1=O
: