Target
Mu-type opioid receptor
Ligand
BDBM94503
Substrate
Meas. Tech.
ChEMBL_1870360 (CHEMBL4371527)
EC50
1.5±n/a nM
Citation
 Tan, LYan, WMcCorvy, JDCheng, J Biased Ligands of G Protein-Coupled Receptors (GPCRs): Structure-Functional Selectivity Relationships (SFSRs) and Therapeutic Potential. J Med Chem 61:9841-9878 (2018)  
Target
Name:
Mu-type opioid receptor
Synonyms:
M-OR-1 MOR-1 MUOR1 Mu opiate receptor OPRM1 hMOP | mu-type opioid receptor isoform MOR-1
Type:
G Protein-Coupled Receptor (GPCR)
Mol. Mass.:
44789.51
Organism:
Homo sapiens (Human)
Description:
P35372
Residue:
400
  
Inhibitor
Name:
BDBM94503
Synonyms:
2-hydroxypropane-1,2,3-tricarboxylic acid;N-[4-(methoxymethyl)-1-(2-thiophen-2-ylethyl)-4-piperidinyl]-N-phenylpropanamide MLS002320668 SMR001338814 Sufentanil citrate cid_65494 | citric acid;N-[4-(methoxymethyl)-1-[2-(2-thienyl)ethyl]-4-piperidyl]-N-phenyl-propionamide
Type:
Small organic molecule
Emp. Form.:
C22H30N2O2S
Mol. Mass.:
386.551
SMILES:
CCC(=O)N(c1ccccc1)C1(COC)CCN(CCc2cccs2)CC1
: