Target
Matrilysin
Ligand
BDBM50071263
Substrate
Meas. Tech.
ChEBML_102124
IC50
1.6±n/a nM
Citation
 Sheppard, GSFlorjancic, ASGiesler, JRXu, LGuo, YDavidsen, SKMarcotte, PAElmore, IAlbert, DHMagoc, TJBouska, JJGoodfellow, CLMorgan, DWSummers, JB Aryl ketones as novel replacements for the C-terminal amide bond of succinyl hydroxamate MMP inhibitors. Bioorg Med Chem Lett 8:3251-6 (1999)  
Target
Name:
Matrilysin
Synonyms:
MMP7 MPSL1 Matrix metalloproteinase-7 (MMP-7) PUMP1
Type:
Enzyme
Mol. Mass.:
29681.54
Organism:
Homo sapiens (Human)
Description:
P09237
Residue:
267
  
Inhibitor
Name:
BDBM50071263
Synonyms:
(7S,8R,11S)-8-Isobutyl-9-oxo-2-oxa-10-aza-bicyclo[11.2.2]heptadeca-1(16),13(17),14-triene-7,11-dicarboxylic acid 7-hydroxyamide 11-methylamide | CHEMBL418292
Type:
Small organic molecule
Emp. Form.:
C22H33N3O5
Mol. Mass.:
419.5145
SMILES:
CNC(=O)[C@@H]1Cc2ccc(OCCCC[C@@H]([C@@H](CC(C)C)C(=O)N1)C(=O)NO)cc2
: