Target
Matrilysin
Ligand
BDBM50071262
Substrate
Meas. Tech.
ChEBML_102124
IC50
6.1±n/a nM
Citation
 Sheppard, GSFlorjancic, ASGiesler, JRXu, LGuo, YDavidsen, SKMarcotte, PAElmore, IAlbert, DHMagoc, TJBouska, JJGoodfellow, CLMorgan, DWSummers, JB Aryl ketones as novel replacements for the C-terminal amide bond of succinyl hydroxamate MMP inhibitors. Bioorg Med Chem Lett 8:3251-6 (1999)  
Target
Name:
Matrilysin
Synonyms:
MMP7 MPSL1 Matrix metalloproteinase-7 (MMP-7) PUMP1
Type:
Enzyme
Mol. Mass.:
29681.54
Organism:
Homo sapiens (Human)
Description:
P09237
Residue:
267
  
Inhibitor
Name:
BDBM50071262
Synonyms:
(8S,9R,12S)-9-Isobutyl-10-oxo-2-oxa-11-aza-bicyclo[12.2.2]octadeca-1(17),14(18),15-triene-8,12-dicarboxylic acid 8-hydroxyamide 12-methylamide | CHEMBL62007
Type:
Small organic molecule
Emp. Form.:
C23H35N3O5
Mol. Mass.:
433.5411
SMILES:
CNC(=O)[C@@H]1Cc2ccc(OCCCCC[C@@H]([C@@H](CC(C)C)C(=O)N1)C(=O)NO)cc2
: