Target
P-selectin
Ligand
BDBM50072621
Substrate
Meas. Tech.
ChEBML_148137
IC50
1000±n/a nM
Citation
 Kuribayashi, TOhkawa, NSatoh, S Aryl C-glycosides: physiologically stable glycomimetics of sialyl Lewis X. Bioorg Med Chem Lett 8:3307-10 (1999)  
Target
Name:
P-selectin
Synonyms:
GMRP LYAM3_HUMAN P-selectin/P-selectin glycoprotein ligand 1 | SELP
Type:
PROTEIN
Mol. Mass.:
90834.61
Organism:
Homo sapiens (Human)
Description:
ChEMBL_1438999
Residue:
830
  
Inhibitor
Name:
BDBM50072621
Synonyms:
CHEMBL112485 | [4-Methoxy-3-(3,4,5-trihydroxy-6-methyl-tetrahydro-pyran-2-yl)-phenyl]-acetic acid
Type:
Small organic molecule
Emp. Form.:
C15H20O7
Mol. Mass.:
312.3151
SMILES:
COc1ccc(CC(O)=O)cc1C1OC(C)C(O)C(O)C1O
: