Target
Tissue alpha-L-fucosidase
Ligand
BDBM50072685
Substrate
Meas. Tech.
ChEMBL_216163 (CHEMBL815334)
IC50
11±n/a nM
Citation
 Wischnat, RMartin, RTakayama, SWong, CH Chemoenzymatic synthesis of iminocyclitol derivatives: a useful library strategy for the development of selective fucosyltransfer enzymes inhibitors. Bioorg Med Chem Lett 8:3353-8 (1999)  
Target
Name:
Tissue alpha-L-fucosidase
Synonyms:
Alpha-L-fucosidase I FUCA1 Tissue alpha-L-fucosidase
Type:
PROTEIN
Mol. Mass.:
53690.69
Organism:
Homo sapiens (Human)
Description:
ChEMBL_34088
Residue:
466
  
Inhibitor
Name:
BDBM50072685
Synonyms:
(3,4,5-Trihydroxy-2-hydroxymethyl-6-methyl-piperidin-1-yl)-acetaldehyde | CHEMBL114103
Type:
Small organic molecule
Emp. Form.:
C9H17NO5
Mol. Mass.:
219.235
SMILES:
CC1C(O)C(O)C(O)C(CO)N1CC=O
: