Target
Tissue alpha-L-fucosidase
Ligand
BDBM50072682
Substrate
Meas. Tech.
ChEMBL_216126 (CHEMBL816946)
IC50
190±n/a nM
Citation
 Wischnat, RMartin, RTakayama, SWong, CH Chemoenzymatic synthesis of iminocyclitol derivatives: a useful library strategy for the development of selective fucosyltransfer enzymes inhibitors. Bioorg Med Chem Lett 8:3353-8 (1999)  
Target
Name:
Tissue alpha-L-fucosidase
Synonyms:
Alpha-L-fucosidase I FUCA1 Tissue alpha-L-fucosidase
Type:
PROTEIN
Mol. Mass.:
53690.69
Organism:
Homo sapiens (Human)
Description:
ChEMBL_34088
Residue:
466
  
Inhibitor
Name:
BDBM50072682
Synonyms:
CHEMBL115930 | {[(3,4,5-Trihydroxy-2-hydroxymethyl-6-methyl-piperidin-2-ylmethyl)-carbamoyl]-methyl}-carbamic acid benzyl ester
Type:
Small organic molecule
Emp. Form.:
C18H27N3O7
Mol. Mass.:
397.4229
SMILES:
CC1NC(CO)(CNC(=O)CNC(=O)OCc2ccccc2)C(O)C(O)C1O
: