Target
Protein kinase C alpha type
Ligand
BDBM50072734
Substrate
Meas. Tech.
ChEBML_152972
Ki
7460±n/a nM
Citation
 Benzaria, SBienfait, BNacro, KWang, SLewin, NEBeheshti, MBlumberg, PMMarquez, VE Conformationally constrained analogues of diacylglycerol (DAG). 15. The indispensable role of the sn-1 and sn-2 carbonyls in the binding of DAG-lactones to protein kinase C (PK-C). Bioorg Med Chem Lett 8:3403-8 (1999)  
Target
Name:
Protein kinase C alpha type
Synonyms:
KPCA_HUMAN PKC alpha and beta-2 PKC-alpha PRKACA Protein Kinase C- alpha Protein kinase C alpha (PKCa) Protein kinase C alpha type (PRKCA) RAF proto-oncogene serine/threonine-protein kinase
Type:
Enzyme
Mol. Mass.:
76755.65
Organism:
Homo sapiens (Human)
Description:
The recombinant human PKC enzymes were produced using a baculovirus expression system in SF9 cells
Residue:
672
  
Inhibitor
Name:
BDBM50072734
Synonyms:
5-Ethoxymethyl-5-hydroxymethyl-3-tetradec-(Z)-ylidene-dihydro-furan-2-one | CHEMBL324172
Type:
Small organic molecule
Emp. Form.:
C22H40O4
Mol. Mass.:
368.5506
SMILES:
CCCCCCCCCCCCC\C=C1\CC(CO)(COCC)OC1=O
: