Target
Prothrombin
Ligand
BDBM50072846
Substrate
Meas. Tech.
ChEMBL_210594 (CHEMBL816561)
Ki
16±n/a nM
Citation
 Renatus, MBode, WHuber, RStürzebecher, JStubbs, MT Structural and functional analyses of benzamidine-based inhibitors in complex with trypsin: implications for the inhibition of factor Xa, tPA, and urokinase. J Med Chem 41:5445-56 (1999)  
Target
Name:
Prothrombin
Synonyms:
Activation peptide fragment 1 Coagulation factor II Prothrombin Thrombin Thrombin light chain
Type:
Enzyme
Mol. Mass.:
70502.73
Organism:
Bos taurus (Bovine)
Description:
P00735
Residue:
625
  
Inhibitor
Name:
BDBM50072846
Synonyms:
3-[3-(4-Methyl-piperidin-1-yl)-2-(naphthalene-1-sulfonylamino)-3-oxo-propyl]-benzamidine | CHEMBL348443
Type:
Small organic molecule
Emp. Form.:
C26H30N4O3S
Mol. Mass.:
478.606
SMILES:
CC1CCN(CC1)C(=O)C(Cc1cccc(c1)C(N)=N)NS(=O)(=O)c1cccc2ccccc12
: