Target
Alpha-1A adrenergic receptor
Ligand
BDBM50073025
Substrate
Meas. Tech.
ChEMBL_33748 (CHEMBL647825)
Ki
1.1±n/a nM
Citation
 Barlocco, DCignarella, GMontesano, FLeonardi, AMella, MToma, L Novel adrenoceptor antagonists with a tricyclic pyrrolodipyridazine skeleton. J Med Chem 42:173-7 (1999)  
Target
Name:
Alpha-1A adrenergic receptor
Synonyms:
ADA1A_HUMAN ADRA1C Alpha 1A-adrenoceptor Alpha adrenergic receptor 1a Alpha-adrenergic receptor 1c adrenergic Alpha1 | adrenergic Alpha1C
Type:
Cell-surface receptors
Mol. Mass.:
51511.67
Organism:
Homo sapiens (Human)
Description:
P35348
Residue:
466
  
Inhibitor
Name:
BDBM50073025
Synonyms:
8-Chloro-2-{2-[4-(2-methoxy-phenyl)-piperazin-1-yl]-ethylamino}-6-methyl-6H-1,6,7,9a-tetraaza-fluoren-5-one | CHEMBL301078
Type:
Small organic molecule
Emp. Form.:
C23H26ClN7O2
Mol. Mass.:
467.951
SMILES:
COc1ccccc1N1CCN(CCNc2ccc3c4c(cn3n2)c(Cl)nn(C)c4=O)CC1
: