Target
Neuropeptide Y receptor type 1
Ligand
BDBM50065468
Substrate
Meas. Tech.
ChEMBL_143836 (CHEMBL748719)
IC50
1.7±n/a nM
Citation
 Kordik, CPReitz, AB Pharmacological treatment of obesity: therapeutic strategies. J Med Chem 42:181-201 (1999)  
Target
Name:
Neuropeptide Y receptor type 1
Synonyms:
FC5 NPY1-R Neuropeptide Y receptor type 1 | Npy1r
Type:
Enzyme Catalytic Domain
Mol. Mass.:
44126.41
Organism:
RAT
Description:
NPY-Y1 NPY1R RAT::P21555
Residue:
382
  
Inhibitor
Name:
BDBM50065468
Synonyms:
2-(4-Chloro-phenoxymethyl)-4-(3-piperidin-1-yl-propoxy)-1-(3-piperidin-3-yl-propyl)-1H-benzoimidazole | CHEMBL61532
Type:
Small organic molecule
Emp. Form.:
C30H41ClN4O2
Mol. Mass.:
525.125
SMILES:
Clc1ccc(OCc2nc3c(OCCCN4CCCCC4)cccc3n2CCCC2CCCNC2)cc1
: