Target
Neuropeptide Y receptor type 1
Ligand
BDBM50073054
Substrate
Meas. Tech.
ChEMBL_143839 (CHEMBL747050)
IC50
39±n/a nM
Citation
 Kordik, CPReitz, AB Pharmacological treatment of obesity: therapeutic strategies. J Med Chem 42:181-201 (1999)  
Target
Name:
Neuropeptide Y receptor type 1
Synonyms:
NPY-Y1 NPY1R NPYR neuropeptide Y receptor Y1
Type:
Enzyme Catalytic Domain
Mol. Mass.:
44399.07
Organism:
Homo sapiens (Human)
Description:
NPY-Y1 NPY1R HUMAN::P25929
Residue:
384
  
Inhibitor
Name:
BDBM50073054
Synonyms:
1-[4-Ethyl-1-(3-methoxymethoxy-phenyl)-cyclohexyl]-4-phenyl-piperazine | CHEMBL60737
Type:
Small organic molecule
Emp. Form.:
C26H36N2O2
Mol. Mass.:
408.5762
SMILES:
CC[C@H]1CC[C@](CC1)(N1CCN(CC1)c1ccccc1)c1cccc(OCOC)c1
: