Target
Spindlin-1
Ligand
BDBM50446376
Substrate
Meas. Tech.
ChEMBL_1875895 (CHEMBL4377289)
IC50
207±n/a nM
Citation
 Xiong, YGreschik, HJohansson, CSeifert, LBacher, JPark, KSBabault, NMartini, MFagan, VLi, FChau, IChristott, TDilworth, DBarsyte-Lovejoy, DVedadi, MArrowsmith, CHBrennan, PFedorov, OJung, MFarnie, GLiu, JOppermann, USchüle, RJin, J Discovery of a Potent and Selective Fragment-like Inhibitor of Methyllysine Reader Protein Spindlin 1 (SPIN1). J Med Chem 62:8996-9007 (2019)  
Target
Name:
Spindlin-1
Synonyms:
OCR SPIN SPIN1_HUMAN Spindlin1
Type:
PROTEIN
Mol. Mass.:
29602.24
Organism:
Homo sapiens
Description:
ChEMBL_119259
Residue:
262
  
Inhibitor
Name:
BDBM50446376
Synonyms:
CHEMBL3109630
Type:
Small organic molecule
Emp. Form.:
C19H27N3O2
Mol. Mass.:
329.4366
SMILES:
COc1cc2c(cc1OCCCN1CCCC1)N=C(N)C21CCC1
: