Target
5-hydroxytryptamine receptor 1D
Ligand
BDBM50073688
Substrate
Meas. Tech.
ChEMBL_1672 (CHEMBL616663)
EC50
0.22±n/a nM
Citation
 Xu, YCSchaus, JMWalker, CKrushinski, JAdham, NZgombick, JMLiang, SXKohlman, DTAudia, JE N-Methyl-5-tert-butyltryptamine: A novel, highly potent 5-HT1D receptor agonist. J Med Chem 42:526-31 (1999)  
Target
Name:
5-hydroxytryptamine receptor 1D
Synonyms:
5-HT-1D 5-HT1D 5HT1D_HUMAN HTR1DA Serotonin (5-HT) receptor | Serotonin Receptor 1D
Type:
G Protein-Coupled Receptor (GPCR)
Mol. Mass.:
41920.63
Organism:
Homo sapiens (Human)
Description:
Receptor binding assays were performed using human clone stably expressed in CHO cells.
Residue:
377
  
Inhibitor
Name:
BDBM50073688
Synonyms:
CHEMBL357034 | [2-(5-tert-Butyl-1H-indol-3-yl)-ethyl]-methyl-amine
Type:
Small organic molecule
Emp. Form.:
C15H22N2
Mol. Mass.:
230.3486
SMILES:
CNCCc1c[nH]c2ccc(cc12)C(C)(C)C
: