Target
Cholecystokinin receptor type A
Ligand
BDBM50073722
Substrate
Meas. Tech.
ChEBML_40051
IC50
460±n/a nM
Citation
 de la Figuera, NMartín-Martínez, MHerranz, RGarcía-López, MTLatorre, MCenarruzabeitia, Edel Río, JGonzález-Muñiz, R Highly constrained dipeptoid analogues containing a type II' beta-turn mimic as novel and selective CCK-A receptor ligands. Bioorg Med Chem Lett 9:43-8 (1999)  
Target
Name:
Cholecystokinin receptor type A
Synonyms:
CCKAR_RAT Cholecystokinin peripheral Cholecystokinin receptor type A
Type:
Enzyme Catalytic Domain
Mol. Mass.:
49676.37
Organism:
RAT
Description:
Cholecystokinin central 0 RAT::P30551
Residue:
444
  
Inhibitor
Name:
BDBM50073722
Synonyms:
(S)-3-[((2S,5S,11bS)-2-Benzyloxycarbonylamino-3-oxo-2,3,5,6,11,11b-hexahydro-1H-indolizino[8,7-b]indole-5-carbonyl)-amino]-4-phenyl-butyric acid 2-trimethylsilanyl-ethyl ester | CHEMBL358989
Type:
Small organic molecule
Emp. Form.:
C38H44N4O6Si
Mol. Mass.:
680.8647
SMILES:
C[Si](C)(C)CCOC(=O)C[C@H](Cc1ccccc1)NC(=O)[C@@H]1Cc2c([nH]c3ccccc23)[C@@H]2C[C@H](NC(=O)OCc3ccccc3)C(=O)N12
: