Target
Gastrin/cholecystokinin type B receptor
Ligand
BDBM50073729
Substrate
Meas. Tech.
ChEMBL_40202 (CHEMBL652247)
IC50
259±n/a nM
Citation
 de la Figuera, NMartín-Martínez, MHerranz, RGarcía-López, MTLatorre, MCenarruzabeitia, Edel Río, JGonzález-Muñiz, R Highly constrained dipeptoid analogues containing a type II' beta-turn mimic as novel and selective CCK-A receptor ligands. Bioorg Med Chem Lett 9:43-8 (1999)  
Target
Name:
Gastrin/cholecystokinin type B receptor
Synonyms:
Cckbr Cholecystokinin receptor Gastrin/cholecystokinin type B receptor
Type:
Enzyme Catalytic Domain
Mol. Mass.:
49196.59
Organism:
MOUSE
Description:
Cholecystokinin A CCKBR MOUSE::P56481
Residue:
453
  
Inhibitor
Name:
BDBM50073729
Synonyms:
(R)-3-[(S)-2-(Adamantan-2-yloxycarbonylamino)-3-(1H-indol-3-yl)-2-methyl-propionylamino]-4-phenyl-butyric acid PD-140548
Type:
Small organic molecule
Emp. Form.:
C33H39N3O5
Mol. Mass.:
557.6799
SMILES:
C[C@@](Cc1c[nH]c2ccccc12)(NC(=O)OC1C2CC3CC(C2)CC1C3)C(=O)N[C@@H](CC(O)=O)Cc1ccccc1
: