Target
Beta-galactosidase
Ligand
BDBM50073992
Substrate
Meas. Tech.
ChEBML_39370
Ki
18000±n/a nM
Citation
 Schaller, CDemange, RPicasso, SVogel, P Specific, uncompetitive inhibition of beta-galactosidases by a 5,6-isopropylidenedioxyfuro[2,3-d]isoxazole-3-methanol derivative. Bioorg Med Chem Lett 9:277-8 (1999)  
Target
Name:
Beta-galactosidase
Synonyms:
BGAL_ASPNG | lacA
Type:
PROTEIN
Mol. Mass.:
109138.60
Organism:
Aspergillus niger
Description:
ChEMBL_39387
Residue:
1006
  
Inhibitor
Name:
BDBM50073992
Synonyms:
((3aS,4aS,7aS,7bR)-6,6-Dimethyl-3a,4a,7a,7b-tetrahydro-[1,3]dioxolo[4',5':4,5]furo[2,3-d]isoxazol-3-yl)-methanol | CHEMBL93319
Type:
Small organic molecule
Emp. Form.:
C9H13NO5
Mol. Mass.:
215.2032
SMILES:
CC1(C)O[C@@H]2O[C@@H]3[C@@H](ON=C3CO)[C@@H]2O1
: