Target
Asialoglycoprotein receptor 1
Ligand
BDBM50074089
Substrate
Meas. Tech.
ChEMBL_36369 (CHEMBL650120)
Ki
200±n/a nM
Citation
 Sliedregt, LARensen, PCRump, ETvan Santbrink, PJBijsterbosch, MKValentijn, ARvan der Marel, GAvan Boom, JHvan Berkel, TJBiessen, EA Design and synthesis of novel amphiphilic dendritic galactosides for selective targeting of liposomes to the hepatic asialoglycoprotein receptor. J Med Chem 42:609-18 (1999)  
Target
Name:
Asialoglycoprotein receptor 1
Synonyms:
ASGP-R 1 ASGR1_MOUSE Asgr1 Hepatic lectin 1 | mHL-1
Type:
PROTEIN
Mol. Mass.:
32590.63
Organism:
Mus musculus
Description:
ChEMBL_36369
Residue:
284
  
Inhibitor
Name:
BDBM50074089
Synonyms:
CHEMBL2368207 | TG(20)C-Galactoside analogue
Type:
Small organic molecule
Emp. Form.:
C86H153N3O38
Mol. Mass.:
1837.1323
SMILES:
[H][C@@]12CC[C@H](C(C)CCCC(C)C)[C@@]1(C)CC[C@@]1([H])[C@@]2([H])CC=C2C[C@H](CC[C@]12C)OC(=O)CNC(=O)CCCCC(=O)NCC(=O)NC(COCOCCOCCOCCOCCO[C@@H]1O[C@@H](CO)[C@H](O)[C@H](O)[C@@H]1O)(COCOCCOCCOCCOCCO[C@@H]1O[C@@H](CO)[C@H](O)[C@H](O)[C@@H]1O)COCOCCOCCOCCOCCO[C@@H]1O[C@@H](CO)[C@H](O)[C@H](O)[C@@H]1O
: