Target
5-hydroxytryptamine receptor 1D
Ligand
BDBM50074186
Substrate
Meas. Tech.
ChEMBL_1704 (CHEMBL616911)
IC50
0.1±n/a nM
Citation
 Chambers, MSStreet, LJGoodacre, SHobbs, SCHunt, PJelley, RAMatassa, VGReeve, AJSternfeld, FBeer, MSStanton, JARathbone, DWatt, APMacLeod, AM 3-(Piperazinylpropyl)indoles: selective, orally bioavailable h5-HT1D receptor agonists as potential antimigraine agents. J Med Chem 42:691-705 (1999)  
Target
Name:
5-hydroxytryptamine receptor 1D
Synonyms:
5-HT-1D 5-HT1D 5HT1D_HUMAN HTR1DA Serotonin (5-HT) receptor | Serotonin Receptor 1D
Type:
G Protein-Coupled Receptor (GPCR)
Mol. Mass.:
41920.63
Organism:
Homo sapiens (Human)
Description:
Receptor binding assays were performed using human clone stably expressed in CHO cells.
Residue:
377
  
Inhibitor
Name:
BDBM50074186
Synonyms:
3-{3-[4-(4-Fluoro-benzyl)-piperazin-1-yl]-propyl}-5-[1,2,4]triazol-4-yl-1H-indole | CHEMBL161723
Type:
Small organic molecule
Emp. Form.:
C24H27FN6
Mol. Mass.:
418.5098
SMILES:
Fc1ccc(CN2CCN(CCCc3c[nH]c4ccc(cc34)-n3cnnc3)CC2)cc1
: