Target
Retinoic acid receptor RXR-gamma
Ligand
BDBM50074303
Substrate
Meas. Tech.
ChEMBL_197240 (CHEMBL803362)
Ki
>1000±n/a nM
Citation
 Canan Koch, SSDardashti, LJCesario, RMCroston, GEBoehm, MFHeyman, RANadzan, AM Synthesis of retinoid X receptor-specific ligands that are potent inducers of adipogenesis in 3T3-L1 cells. J Med Chem 42:742-50 (1999)  
Target
Name:
Retinoic acid receptor RXR-gamma
Synonyms:
NR2B3 RXRG Retinoic acid receptor RXR-gamma Retinoid X receptor gamma/retinoic acid receptor alpha
Type:
PROTEIN
Mol. Mass.:
50878.26
Organism:
Homo sapiens (Human)
Description:
ChEMBL_197216
Residue:
463
  
Inhibitor
Name:
BDBM50074303
Synonyms:
4-[[(E)-Carboxymethoxyimino]-(3,5,5,8,8-pentamethyl-5,6,7,8-tetrahydro-naphthalen-2-yl)-methyl]-benzoic acid | CHEMBL348794
Type:
Small organic molecule
Emp. Form.:
C25H29NO5
Mol. Mass.:
423.5015
SMILES:
Cc1cc2c(cc1\C(=N\OCC(O)=O)c1ccc(cc1)C(O)=O)C(C)(C)CCC2(C)C
: