Target
Retinoic acid receptor RXR-gamma
Ligand
BDBM50408854
Substrate
Meas. Tech.
ChEMBL_197240 (CHEMBL803362)
Ki
238±n/a nM
Citation
 Canan Koch, SSDardashti, LJCesario, RMCroston, GEBoehm, MFHeyman, RANadzan, AM Synthesis of retinoid X receptor-specific ligands that are potent inducers of adipogenesis in 3T3-L1 cells. J Med Chem 42:742-50 (1999)  
Target
Name:
Retinoic acid receptor RXR-gamma
Synonyms:
NR2B3 RXRG Retinoic acid receptor RXR-gamma Retinoid X receptor gamma/retinoic acid receptor alpha
Type:
PROTEIN
Mol. Mass.:
50878.26
Organism:
Homo sapiens (Human)
Description:
ChEMBL_197216
Residue:
463
  
Inhibitor
Name:
BDBM50408854
Synonyms:
CHEMBL2110181
Type:
Small organic molecule
Emp. Form.:
C24H29NO3
Mol. Mass.:
379.492
SMILES:
CO\N=C(\c1ccc(cc1)C(O)=O)c1cc2c(cc1C)C(C)(C)CCC2(C)C
: