Target
Retinoic acid receptor RXR-beta
Ligand
BDBM50408856
Substrate
Meas. Tech.
ChEMBL_197080 (CHEMBL806009)
Ki
>1000±n/a nM
Citation
 Canan Koch, SSDardashti, LJCesario, RMCroston, GEBoehm, MFHeyman, RANadzan, AM Synthesis of retinoid X receptor-specific ligands that are potent inducers of adipogenesis in 3T3-L1 cells. J Med Chem 42:742-50 (1999)  
Target
Name:
Retinoic acid receptor RXR-beta
Synonyms:
NR2B2 RXRB Retinoic acid receptor RXR-beta Retinoid receptor
Type:
PROTEIN
Mol. Mass.:
56932.89
Organism:
Homo sapiens (Human)
Description:
ChEMBL_39045
Residue:
533
  
Inhibitor
Name:
BDBM50408856
Synonyms:
CHEMBL2110182
Type:
Small organic molecule
Emp. Form.:
C27H35NO3
Mol. Mass.:
421.5717
SMILES:
Cc1cc2c(cc1\C(=N/OC(C)(C)C)c1ccc(cc1)C(O)=O)C(C)(C)CCC2(C)C
: