Target
Corticotropin-releasing factor receptor 1
Ligand
BDBM50074509
Substrate
Meas. Tech.
ChEMBL_51114 (CHEMBL664960)
Ki
0.8±n/a nM
Citation
 Chorvat, RJBakthavatchalam, RBeck, JPGilligan, PJWilde, RGCocuzza, AJHobbs, FWCheeseman, RSCurry, MRescinito, JPKrenitsky, PChidester, DYarem, JAKlaczkiewicz, JDHodge, CNAldrich, PEWasserman, ZRFernandez, CHZaczek, RFitzgerald, LWHuang, SMShen, HLWong, YNChien, BMArvanitis, A Synthesis, corticotropin-releasing factor receptor binding affinity, and pharmacokinetic properties of triazolo-, imidazo-, and pyrrolopyrimidines and -pyridines. J Med Chem 42:833-48 (1999)  
Target
Name:
Corticotropin-releasing factor receptor 1
Synonyms:
CRF-R CRF1 CRFR1 CRH-R 1 CRHR1 Corticotropin-releasing factor receptor 1 (CRF-1) Corticotropin-releasing hormone receptor 1
Type:
Enzyme
Mol. Mass.:
50744.31
Organism:
Homo sapiens (Human)
Description:
P34998
Residue:
444
  
Inhibitor
Name:
BDBM50074509
Synonyms:
CHEMBL354886 | [3-(2,4-Dibromo-phenyl)-5-methyl-3H-[1,2,3]triazolo[4,5-d]pyrimidin-7-yl]-(1-propyl-butyl)-amine
Type:
Small organic molecule
Emp. Form.:
C18H22Br2N6
Mol. Mass.:
482.215
SMILES:
CCCC(CCC)Nc1nc(C)nc2n(nnc12)-c1ccc(Br)cc1Br
: