Target
Proto-oncogene tyrosine-protein kinase Src
Ligand
BDBM50074743
Substrate
Meas. Tech.
ChEMBL_221784 (CHEMBL843059)
IC50
8000±n/a nM
Citation
 Traxler, PGreen, JMett, HSéquin, UFuret, P Use of a pharmacophore model for the design of EGFR tyrosine kinase inhibitors: isoflavones and 3-phenyl-4(1H)-quinolones. J Med Chem 42:1018-26 (1999)  
Target
Name:
Proto-oncogene tyrosine-protein kinase Src
Synonyms:
Calmodulin/Proto-oncogene tyrosine-protein kinase Src Proto-oncogene c-Src SRC SRC_HUMAN V-src sarcoma (Schmidt-Ruppin A-2) viral oncogene homolog (avian) p60-Src | pp60c-src
Type:
Protein
Mol. Mass.:
59838.60
Organism:
Homo sapiens (Human)
Description:
P12931
Residue:
536
  
Inhibitor
Name:
BDBM50074743
Synonyms:
3-(3-Chloro-phenyl)-5,7-dihydroxy-1H-quinolin-4-one | CHEMBL266995
Type:
Small organic molecule
Emp. Form.:
C15H10ClNO3
Mol. Mass.:
287.698
SMILES:
Oc1cc(O)c2c(O)c(cnc2c1)-c1cccc(Cl)c1
: