Target
Prostaglandin G/H synthase 1
Ligand
BDBM50074931
Substrate
Meas. Tech.
ChEBML_159281
IC50
15000±n/a nM
Citation
 Bayly, CIBlack, WCLéger, SOuimet, NOuellet, MPercival, MD Structure-based design of COX-2 selectivity into flurbiprofen. Bioorg Med Chem Lett 9:307-12 (1999)  
Target
Name:
Prostaglandin G/H synthase 1
Synonyms:
COX1 Cyclooxygenase-1 (COX-1) PTGS1 | Prostaglandin G/H synthase (cyclooxygenase)
Type:
Protein
Mol. Mass.:
68868.60
Organism:
Ovis aries (Sheep)
Description:
Residue:
600
  
Inhibitor
Name:
BDBM50074931
Synonyms:
2-(2-Fluoro-3'-isopropyl-biphenyl-4-yl)-propionic acid | CHEMBL108281
Type:
Small organic molecule
Emp. Form.:
C18H19FO2
Mol. Mass.:
286.3407
SMILES:
CC(C)c1cccc(c1)-c1ccc(cc1F)C(C)C(O)=O
: