Target
B2 bradykinin receptor
Ligand
BDBM50074997
Substrate
Meas. Tech.
ChEMBL_216335 (CHEMBL818749)
Ki
0.600000±n/a nM
Citation
 Heitsch, HWagner, ASchölkens, BAWirth, K Novel series of O-substituted 8-quinolines and 4-benzothiazoles as potent antagonists of the bradykinin B2 receptors. Bioorg Med Chem Lett 9:327-32 (1999)  
Target
Name:
B2 bradykinin receptor
Synonyms:
B2 bradykinin receptor BDKRB2 BKRB2_CAVPO | Bradykinin B2 receptor
Type:
Mol. Mass.:
42217.03
Organism:
Cavia porcellus
Description:
Residue:
372
  
Inhibitor
Name:
BDBM50074997
Synonyms:
(E)-3-(6-Acetylamino-pyridin-3-yl)-N-({[4-methoxy-3-(2-methyl-quinolin-8-yloxymethyl)-2-methylsulfanyl-phenyl]-methyl-carbamoyl}-methyl)-acrylamide | CHEMBL115163
Type:
Small organic molecule
Emp. Form.:
C32H33N5O5S
Mol. Mass.:
599.7
SMILES:
COc1ccc(N(C)C(=O)CNC(=O)\C=C\c2ccc(NC(C)=O)nc2)c(SC)c1COc1cccc2ccc(C)nc12
: