Target
Chymotrypsin-like elastase family member 2A
Ligand
BDBM50075107
Substrate
Meas. Tech.
ChEBML_158076
IC50
3300±n/a nM
Citation
 Iijima, KKatada, JHayashi, Y Symmetrical anhydride-type serine protease inhibitors: structure-activity relationship studies of human chymase inhibitors. Bioorg Med Chem Lett 9:413-8 (1999)  
Target
Name:
Chymotrypsin-like elastase family member 2A
Synonyms:
CEL2A_PIG ELA2 Elastase 2A Elastase-2A | Pancreatic elastase
Type:
PROTEIN
Mol. Mass.:
28705.23
Organism:
Sus scrofa
Description:
ChEMBL_156951
Residue:
269
  
Inhibitor
Name:
BDBM50075107
Synonyms:
1,1-dimethyl-4-phenyl-2-propylcarboxamidopentanoic anhydride | CHEMBL436591
Type:
Small organic molecule
Emp. Form.:
C34H48N2O5
Mol. Mass.:
564.7553
SMILES:
CCCC(=O)NC(CCc1ccccc1)C(C)(C)C(=O)OC(=O)C(C)(C)C(CCc1ccccc1)NC(=O)CCC
: