Target
Cathepsin G
Ligand
BDBM50075114
Substrate
Meas. Tech.
ChEBML_45350
IC50
48±n/a nM
Citation
 Iijima, KKatada, JHayashi, Y Symmetrical anhydride-type serine protease inhibitors: structure-activity relationship studies of human chymase inhibitors. Bioorg Med Chem Lett 9:413-8 (1999)  
Target
Name:
Cathepsin G
Synonyms:
CATG_HUMAN CTSG
Type:
PROTEIN
Mol. Mass.:
28860.08
Organism:
Homo sapiens (Human)
Description:
ChEMBL_1469016
Residue:
255
  
Inhibitor
Name:
BDBM50075114
Synonyms:
1,1-dimethyl-2-phenylcarboxamidooctanoic anhydride | CHEMBL424453
Type:
Small organic molecule
Emp. Form.:
C34H48N2O5
Mol. Mass.:
564.7553
SMILES:
CCCCCC(NC(=O)c1ccccc1)C(C)(C)C(=O)OC(=O)C(C)(C)C(CCCCC)NC(=O)c1ccccc1
: