Target
Somatostatin receptor type 2
Ligand
BDBM50075283
Substrate
Meas. Tech.
ChEBML_200682
Ki
1.4±n/a nM
Citation
 Pasternak, APan, YMarino, DSanderson, PEMosley, RRohrer, SPBirzin, ETHuskey, SEJacks, TSchleim, KDCheng, KSchaeffer, JMPatchett, AAYang, L Potent, orally bioavailable somatostatin agonists: good absorption achieved by urea backbone cyclization. Bioorg Med Chem Lett 9:491-6 (1999)  
Target
Name:
Somatostatin receptor type 2
Synonyms:
SOMATOSTATIN SST2 SS-2-R SS2R SSTR2 | Somatostatin receptor type 2 (SSTR2)
Type:
Enzyme
Mol. Mass.:
41344.94
Organism:
Homo sapiens (Human)
Description:
P30874
Residue:
369
  
Inhibitor
Name:
BDBM50075283
Synonyms:
(R)-6-Amino-2-{(2R,3S)-3-(1H-indol-3-yl)-2-[2-oxo-3-(1-phenyl-piperidin-3-yl)-imidazolidin-1-yl]-butyrylamino}-hexanoic acid tert-butyl ester | CHEMBL343897
Type:
Small organic molecule
Emp. Form.:
C36H50N6O4
Mol. Mass.:
630.82
SMILES:
C[C@H]([C@@H](N1CCN(C2CCCN(C2)c2ccccc2)C1=O)C(=O)N[C@H](CCCCN)C(=O)OC(C)(C)C)c1c[nH]c2ccccc12
: