Target
Retinoic acid receptor gamma
Ligand
BDBM50075348
Substrate
Meas. Tech.
ChEBML_196320
Kd
254±n/a nM
Citation
 Johnson, ATWang, LGillett, SJChandraratna, RA High affinity retinoic acid receptor antagonists: analogs of AGN 193109. Bioorg Med Chem Lett 9:573-6 (1999)  
Target
Name:
Retinoic acid receptor gamma
Synonyms:
NR1B3 RAR-gamma RARG_HUMAN Retinoic acid receptor gamma | Retinoid receptor
Type:
PROTEIN
Mol. Mass.:
50345.43
Organism:
Homo sapiens (Human)
Description:
ChEMBL_1458016
Residue:
454
  
Inhibitor
Name:
BDBM50075348
Synonyms:
4-[8-(3-Hydroxy-phenyl)-5,5-dimethyl-5,6-dihydro-naphthalen-2-ylethynyl]-benzoic acid | CHEMBL346429
Type:
Small organic molecule
Emp. Form.:
C27H22O3
Mol. Mass.:
394.4618
SMILES:
CC1(C)CC=C(c2cccc(O)c2)c2cc(ccc12)C#Cc1ccc(cc1)C(O)=O
: