Target
Retinoic acid receptor beta
Ligand
BDBM50075352
Substrate
Meas. Tech.
ChEBML_195809
Kd
18±n/a nM
Citation
 Johnson, ATWang, LGillett, SJChandraratna, RA High affinity retinoic acid receptor antagonists: analogs of AGN 193109. Bioorg Med Chem Lett 9:573-6 (1999)  
Target
Name:
Retinoic acid receptor beta
Synonyms:
HAP NR1B2 RAR-beta RARB Retinoic acid receptor RXR-alpha/Retinoic acid receptor beta Retinoid receptor
Type:
PROTEIN
Mol. Mass.:
50498.70
Organism:
Homo sapiens (Human)
Description:
ChEMBL_1458015
Residue:
455
  
Inhibitor
Name:
BDBM50075352
Synonyms:
4-[8-(4-Chloro-phenyl)-5,5-dimethyl-5,6-dihydro-naphthalen-2-ylethynyl]-benzoic acid | CHEMBL157160
Type:
Small organic molecule
Emp. Form.:
C27H21ClO2
Mol. Mass.:
412.907
SMILES:
CC1(C)CC=C(c2ccc(Cl)cc2)c2cc(ccc12)C#Cc1ccc(cc1)C(O)=O
: