Target
cGMP-inhibited 3',5'-cyclic phosphodiesterase 3A/3B
Ligand
BDBM50066454
Substrate
Meas. Tech.
ChEMBL_156458 (CHEMBL764836)
IC50
>100000±n/a nM
Citation
 Ukita, TNakamura, YKubo, AYamamoto, YTakahashi, MKotera, JIkeo, T 1-Arylnaphthalene lignan: a novel scaffold for type 5 phosphodiesterase inhibitor. J Med Chem 42:1293-305 (1999)  
Target
Name:
cGMP-inhibited 3',5'-cyclic phosphodiesterase 3A/3B
Synonyms:
Phosphodiesterase (PDE3) Phosphodiesterase 3 (PDE3) | cGMP-inhibited 3',5'-cyclic phosphodiesterase A/B
Type:
Mol. Mass.:
Description:
ASSAY_ID of ChEMBL is 156458
Components:
This complex has 2 components.
Component 1
Name:
cGMP-inhibited 3',5'-cyclic phosphodiesterase 3B
Synonyms:
CGI-PDE B CGIPDE1 PDE3B Phosphodiesterase 3B Phosphodiesterase Type 3 (PDE3B) cGMP-inhibited 3,5-cyclic phosphodiesterase B
Type:
Enzyme
Mol. Mass.:
124318.95
Organism:
Homo sapiens (Human)
Description:
PDE3B was generated from the full-length recombinant human clone transfected into Sf9 cells.
Residue:
1112
  
Component 2
Name:
cGMP-inhibited 3',5'-cyclic phosphodiesterase 3A
Synonyms:
3',5'-cyclic phosphodiesterase Cyclic GMP-inhibited phosphodiesterase A PDE3A_HUMAN Phosphodiesterase 3 (PDE3) Phosphodiesterase 3A Phosphodiesterase 3A (PDE3A1) cGMP-inhibited 3',5'-cyclic phosphodiesterase A | cGMP-inhibited 3,5-cyclic phosphodiesterase A
Type:
Enzyme
Mol. Mass.:
124966.46
Organism:
Homo sapiens (Human)
Description:
Q14432
Residue:
1141
  
Inhibitor
Name:
BDBM50066454
Synonyms:
CHEMBL25616 | Sodium; 1-{4-[(benzo[1,3]dioxol-5-ylmethyl)-amino]-6-chloro-quinazolin-2-yl}-piperidine-4-carboxylate
Type:
Small organic molecule
Emp. Form.:
C22H20ClN4O4
Mol. Mass.:
439.872
SMILES:
[O-]C(=O)C1CCN(CC1)c1nc(NCc2ccc3OCOc3c2)c2cc(Cl)ccc2n1
: