Target
Vasopressin V1a receptor
Ligand
BDBM50075728
Substrate
Meas. Tech.
ChEMBL_214419 (CHEMBL820283)
Ki
0.23±n/a nM
Citation
 Durroux, TPeter, MTurcatti, GChollet, ABalestre, MNBarberis, CSeyer, R Fluorescent pseudo-peptide linear vasopressin antagonists: design, synthesis, and applications. J Med Chem 42:1312-9 (1999)  
Target
Name:
Vasopressin V1a receptor
Synonyms:
AVPR V1a AVPR1A V1AR_HUMAN VASOPRESSIN V1A Vasopressin V1 receptor Vasopressin receptor
Type:
Receptor
Mol. Mass.:
46820.18
Organism:
Homo sapiens (Human)
Description:
P37288
Residue:
418
  
Inhibitor
Name:
BDBM50075728
Synonyms:
4HOPh(CH2)2CO-DTyr(Me)-Phe-Gln-Asn-Arg-Pro-Lys(6C-Flu)-NH2 | CHEMBL429725
Type:
Small organic molecule
Emp. Form.:
C75H86N14O18
Mol. Mass.:
1471.5683
SMILES:
CN([C@H](Cc1ccc(O)cc1)C(=O)N[C@@H](Cc1ccccc1)C(=O)N[C@@H](CCC(N)=O)C(=O)N[C@@H](CC(N)=O)C(=O)N[C@@H](CCCNC(N)=N)C(=O)N1CCC[C@H]1C(=O)N([C@@H](CCCCN)C(N)=O)C(=O)c1ccc2C(=O)OC3(c2c1)c1ccc(O)cc1Oc1cc(O)ccc31)C(=O)CCc1ccc(O)cc1
: