Target
Prothrombin
Ligand
BDBM50075926
Substrate
Meas. Tech.
ChEBML_209092
Ki
0.300000±n/a nM
Citation
 Zhang, MBailey, DLBastian, JABriggs, SLChirgadze, NYClawson, DKDenney, MLGifford-Moore, DSHarper, RWJohnson, LMKlimkowski, VJKohn, TJLin, HSMcCowan, JRRichett, MESall, DJSmith, AJSmith, GFSnyder, DWTakeuchi, KUtterback, BGYan, SC Dibasic benzo[b]thiophene derivatives as a novel class of active site directed thrombin inhibitors: 2. Sidechain optimization and demonstration of in vivo efficacy. Bioorg Med Chem Lett 9:775-80 (1999)  
Target
Name:
Prothrombin
Synonyms:
Activation peptide fragment 1 Coagulation factor II Prothrombin precursor Thrombin heavy chain | Thrombin light chain
Type:
Protein
Mol. Mass.:
70029.57
Organism:
Homo sapiens (Human)
Description:
P00734
Residue:
622
  
Inhibitor
Name:
BDBM50075926
Synonyms:
3-(3-Methoxy-4-pyrrolidin-1-ylmethyl-benzyl)-2-[4-(2-pyrrolidin-1-yl-ethyl)-phenyl]-benzo[b]thiophen-6-ol | CHEMBL168171
Type:
Small organic molecule
Emp. Form.:
C33H38N2O2S
Mol. Mass.:
526.732
SMILES:
COc1cc(Cc2c(sc3cc(O)ccc23)-c2ccc(CCN3CCCC3)cc2)ccc1CN1CCCC1
: