Target
Muscarinic acetylcholine receptor M2
Ligand
BDBM50076082
Substrate
Meas. Tech.
ChEBML_140092
Ki
312±n/a nM
Citation
 Doller, DChackalamannil, SCzarniecki, MMcQuade, RRuperto, V Design, synthesis, and structure-activity relationship studies of himbacine derived muscarinic receptor antagonists. Bioorg Med Chem Lett 9:901-6 (1999)  
Target
Name:
Muscarinic acetylcholine receptor M2
Synonyms:
ACM2_HUMAN Cholinergic, muscarinic M2 Muscarinic acetylcholine receptor M2 and M5 | RecName: Full=Muscarinic acetylcholine receptor M2
Type:
GPCR
Mol. Mass.:
51730.61
Organism:
Homo sapiens (Human)
Description:
P08172
Residue:
466
  
Inhibitor
Name:
BDBM50076082
Synonyms:
(3S,3aR,4R,4aS,8aR,9aS)-3-Methyl-4-[3-(3-methyl-piperidin-1-yl)-propyl]-decahydro-naphtho[2,3-c]furan-1-one | CHEMBL355475
Type:
Small organic molecule
Emp. Form.:
C22H37NO2
Mol. Mass.:
347.5347
SMILES:
C[C@@H]1OC(=O)[C@H]2C[C@H]3CCCC[C@@H]3[C@@H](CCCN3CCCC(C)C3)[C@@H]12
: