Target
Muscarinic acetylcholine receptor M1
Ligand
BDBM50076099
Substrate
Meas. Tech.
ChEBML_139845
Ki
857±n/a nM
Citation
 Doller, DChackalamannil, SCzarniecki, MMcQuade, RRuperto, V Design, synthesis, and structure-activity relationship studies of himbacine derived muscarinic receptor antagonists. Bioorg Med Chem Lett 9:901-6 (1999)  
Target
Name:
Muscarinic acetylcholine receptor M1
Synonyms:
ACM1_HUMAN Cholinergic receptor, muscarinic 1 | Cholinergic, muscarinic M1
Type:
Protein
Mol. Mass.:
51442.54
Organism:
Homo sapiens (Human)
Description:
P11229
Residue:
460
  
Inhibitor
Name:
BDBM50076099
Synonyms:
(3S,3aR,4R,4aS,8aR,9aS)-3-Methyl-4-[3-((R)-3-methyl-piperazin-1-yl)-propyl]-decahydro-naphtho[2,3-c]furan-1-one | CHEMBL368990
Type:
Small organic molecule
Emp. Form.:
C21H36N2O2
Mol. Mass.:
348.5227
SMILES:
C[C@@H]1OC(=O)[C@H]2C[C@H]3CCCC[C@@H]3[C@@H](CCCN3CCN[C@H](C)C3)[C@@H]12
: