Target
Plasmepsin II
Ligand
BDBM50076287
Substrate
Meas. Tech.
ChEMBL_154909 (CHEMBL764684)
Ki
4.1±n/a nM
Citation
 Haque, TSSkillman, AGLee, CEHabashita, HGluzman, IYEwing, TJGoldberg, DEKuntz, IDEllman, JA Potent, low-molecular-weight non-peptide inhibitors of malarial aspartyl protease plasmepsin II. J Med Chem 42:1428-40 (1999)  
Target
Name:
Plasmepsin II
Synonyms:
Aspartic hemoglobinase II PLM2_PLAFX Plasmepsin 2 Plasmepsin-II
Type:
Enzyme
Mol. Mass.:
51482.09
Organism:
Plasmodium falciparum
Description:
P46925
Residue:
453
  
Inhibitor
Name:
BDBM50076287
Synonyms:
1-Methyl-piperidine-4-carboxylic acid [(2S,3S)-3-(4-benzyloxy-3,5-dimethoxy-benzoylamino)-2-hydroxy-4-phenyl-butyl]-[2-(4-methoxy-phenyl)-ethyl]-amide | CHEMBL32684
Type:
Small organic molecule
Emp. Form.:
C42H51N3O7
Mol. Mass.:
709.8702
SMILES:
COc1ccc(CCN(C[C@H](O)[C@H](Cc2ccccc2)NC(=O)c2cc(OC)c(OCc3ccccc3)c(OC)c2)C(=O)C2CCN(C)CC2)cc1
: