Target
5-hydroxytryptamine receptor 1D
Ligand
BDBM50076428
Substrate
Meas. Tech.
ChEMBL_3532 (CHEMBL619199)
Ki
1±n/a nM
Citation
 Lang, LJagoda, ESchmall, BVuong, BKAdams, HRNelson, DLCarson, REEckelman, WC Development of fluorine-18-labeled 5-HT1A antagonists. J Med Chem 42:1576-86 (1999)  
Target
Name:
5-hydroxytryptamine receptor 1D
Synonyms:
5-hydroxytryptamine receptor 1D (5HT1D) Gpcr14 Serotonin 1d (5-HT1d) receptor
Type:
Enzyme
Mol. Mass.:
41605.88
Organism:
Mus musculus (Mouse)
Description:
Q61224
Residue:
374
  
Inhibitor
Name:
BDBM50076428
Synonyms:
4-Fluoro-cyclohexanecarboxylic acid {2-[4-(2-methoxy-phenyl)-piperazin-1-yl]-ethyl}-pyridin-2-yl-amide | CHEMBL38413
Type:
Small organic molecule
Emp. Form.:
C25H33FN4O2
Mol. Mass.:
440.5535
SMILES:
COc1ccccc1N1CCN(CCN(C(=O)C2CCC(F)CC2)c2ccccn2)CC1
: