Target
Metabotropic glutamate receptor 5
Ligand
BDBM50076476
Substrate
Meas. Tech.
ChEMBL_219030 (CHEMBL818798)
EC50
49000±n/a nM
Citation
 Littman, LTokar, CVenkatraman, SRoon, RJKoerner, JFRobinson, MBJohnson, RL Cyclobutane quisqualic acid analogues as selective mGluR5a metabotropic glutamic acid receptor ligands. J Med Chem 42:1639-47 (1999)  
Target
Name:
Metabotropic glutamate receptor 5
Synonyms:
GPRC1E GRM5_HUMAN metabotropic glutamate 5 | metabotropic glutamate 5a
Type:
Enzyme
Mol. Mass.:
132484.72
Organism:
Homo sapiens (Human)
Description:
Residue:
1212
  
Inhibitor
Name:
BDBM50076476
Synonyms:
1-Amino-3-(3,5-dioxo-[1,2,4]oxadiazolidin-2-yl)-cyclobutanecarboxylic acid | CHEMBL44296
Type:
Small organic molecule
Emp. Form.:
C7H9N3O5
Mol. Mass.:
215.1635
SMILES:
N[C@]1(C[C@@H](C1)n1oc(=O)[nH]c1=O)C(O)=O
: