Target
Prothrombin
Ligand
BDBM50451005
Substrate
Meas. Tech.
ChEBML_48300
Ki
0.042000±n/a nM
Citation
 Dominguez, CDuffy, DEHan, QAlexander, RSGalemmo, RAPark, JMWong, PCAmparo, ECKnabb, RMLuettgen, JWexler, RR Design and synthesis of potent and selective 5,6-fused heterocyclic thrombin inhibitors. Bioorg Med Chem Lett 9:925-30 (1999)  
Target
Name:
Prothrombin
Synonyms:
Activation peptide fragment 1 Coagulation factor II Prothrombin precursor Thrombin heavy chain | Thrombin light chain
Type:
Protein
Mol. Mass.:
70029.57
Organism:
Homo sapiens (Human)
Description:
P00734
Residue:
622
  
Inhibitor
Name:
BDBM50451005
Synonyms:
CHEMBL290376 | DuP-714
Type:
Small organic molecule
Emp. Form.:
C21H33BN6O5
Mol. Mass.:
460.335
SMILES:
CC(=O)N[C@H](Cc1ccccc1)C(=O)N1CCC[C@H]1C(=O)N[C@@H](CCCNC(N)=N)B(O)O
: