Target
Large neutral amino acids transporter small subunit 1
Ligand
BDBM50463209
Substrate
Meas. Tech.
ChEMBL_1885219 (CHEMBL4386801)
IC50
100000±n/a nM
Citation
 Hall, CWolfe, HWells, AChien, HCColas, CSchlessinger, AGiacomini, KMThomas, AA l-Type amino acid transporter 1 activity of 1,2,3-triazolyl analogs of l-histidine and l-tryptophan. Bioorg Med Chem Lett 29:2254-2258 (2019)  
Target
Name:
Large neutral amino acids transporter small subunit 1
Synonyms:
4F2 LC 4F2LC CD98LC Integral membrane protein E16 LAT1 Large neutral amino acids transporter small subunit 1 SLC7A5 hLAT1 | y+ system cationic amino acid transporter
Type:
PROTEIN
Mol. Mass.:
55013.61
Organism:
Homo sapiens (Human)
Description:
ChEMBL_100160
Residue:
507
  
Inhibitor
Name:
BDBM50463209
Synonyms:
CHEMBL4249170
Type:
Small organic molecule
Emp. Form.:
C8H10N2O2
Mol. Mass.:
166.1772
SMILES:
N[C@@H](Cc1ccncc1)C(O)=O
: