Target
Polyunsaturated fatty acid 5-lipoxygenase
Ligand
BDBM50001183
Substrate
Meas. Tech.
ChEBML_4160
IC50
1700±n/a nM
Citation
 Connolly, PJWetter, SKBeers, KNHamel, SCChen, RHWachter, MPAnsell, JSinger, MMSteber, MRitchie, DMArgentieri, DC N-hydroxyurea and hydroxamic acid inhibitors of cyclooxygenase and 5-lipoxygenase. Bioorg Med Chem Lett 9:979-84 (1999)  
Target
Name:
Polyunsaturated fatty acid 5-lipoxygenase
Synonyms:
Alox5 LOX5_RAT
Type:
PROTEIN
Mol. Mass.:
78082.31
Organism:
Rattus norvegicus
Description:
ChEMBL_1432947
Residue:
673
  
Inhibitor
Name:
BDBM50001183
Synonyms:
3-[5-(4-Chloro-phenyl)-1-(4-methoxy-phenyl)-1H-pyrazol-3-yl]-N-hydroxy-N-methyl-propionamide Tepoxalin
Type:
Small organic molecule
Emp. Form.:
C20H20ClN3O3
Mol. Mass.:
385.844
SMILES:
COc1ccc(cc1)-n1nc(CCC(=O)N(C)O)cc1-c1ccc(Cl)cc1
: