Target
Beta-lactamase TEM
Ligand
BDBM50076672
Substrate
Meas. Tech.
ChEBML_41206
IC50
8000±n/a nM
Citation
 Bitha, PLi, ZFrancisco, GDRasmussen, BALin, YI 6-(1-Hydroxyalkyl)penam sulfone derivatives as inhibitors of class A and class C beta-lactamases I. Bioorg Med Chem Lett 9:991-6 (1999)  
Target
Name:
Beta-lactamase TEM
Synonyms:
BLAT_ECOLX Beta-lactamase (TEM-1) Beta-lactamase TEM-1 Beta-lactamase TEM1D Beta-lactamase TEM1F TEM extended-spectrum beta-lactamase bla
Type:
Enzyme
Mol. Mass.:
31512.33
Organism:
Escherichia coli
Description:
P62593
Residue:
286
  
Inhibitor
Name:
BDBM50076672
Synonyms:
(2S,5R,6S)-6-Hydroxymethyl-3,3-dimethyl-4,4,7-trioxo-4lambda*6*-thia-1-aza-bicyclo[3.2.0]heptane-2-carboxylic acid Sodium; (2S,5R,6S)-6-hydroxymethyl-3,3-dimethyl-4,4,7-trioxo-4lambda*6*-thia-1-aza-bicyclo[3.2.0]heptane-2-carboxylate
Type:
Small organic molecule
Emp. Form.:
C9H13NO6S
Mol. Mass.:
263.268
SMILES:
CC1(C)[C@@H](N2[C@@H]([C@@H](CO)C2=O)S1(=O)=O)C(O)=O
: