Target
Beta-lactamase TEM
Ligand
BDBM50076679
Substrate
Meas. Tech.
ChEBML_41207
IC50
74±n/a nM
Citation
 Bitha, PLi, ZFrancisco, GDYang, YPetersen, PJLenoy, ELin, YI 6-(1-Hydroxyalkyl))penam sulfone derivatives as inhibitors of class A and class C beta-lactamases II. Bioorg Med Chem Lett 9:997-1002 (1999)  
Target
Name:
Beta-lactamase TEM
Synonyms:
BLAT_ECOLX Beta-lactamase (TEM-1) Beta-lactamase TEM-1 Beta-lactamase TEM1D Beta-lactamase TEM1F TEM extended-spectrum beta-lactamase bla
Type:
Enzyme
Mol. Mass.:
31512.33
Organism:
Escherichia coli
Description:
P62593
Residue:
286
  
Inhibitor
Name:
BDBM50076679
Synonyms:
CHEMBL269471 | Sodium; (2S,3S,5R,6R)-3-((E)-2-cyano-vinyl)-6-hydroxymethyl-3-methyl-4,4,7-trioxo-4lambda*6*-thia-1-aza-bicyclo[3.2.0]heptane-2-carboxylate
Type:
Small organic molecule
Emp. Form.:
C11H11N2O6S
Mol. Mass.:
299.28
SMILES:
C[C@]1(\C=C\C#N)[C@@H](N2[C@@H]([C@H](CO)C2=O)S1(=O)=O)C([O-])=O
: