Target
Epidermal growth factor receptor
Ligand
BDBM4567
Substrate
Meas. Tech.
ChEMBL_64443 (CHEMBL674018)
IC50
0.700000±n/a nM
Citation
 Smaill, JBPalmer, BDRewcastle, GWDenny, WAMcNamara, DJDobrusin, EMBridges, AJZhou, HShowalter, HDWinters, RTLeopold, WRFry, DWNelson, JMSlintak, VElliot, WLRoberts, BJVincent, PWPatmore, SJ Tyrosine kinase inhibitors. 15. 4-(Phenylamino)quinazoline and 4-(phenylamino)pyrido[d]pyrimidine acrylamides as irreversible inhibitors of the ATP binding site of the epidermal growth factor receptor. J Med Chem 42:1803-15 (1999)  
Target
Name:
Epidermal growth factor receptor
Synonyms:
EGF Receptor Substrate EGFR_HUMAN ERBB1 Epidermal Growth Factor Receptor erbB-1 Epidermal growth factor receptor (EGFR) HER1 Proto-oncogene c-ErbB-1 Tyrosine-Protein Kinase ErbB-1
Type:
Receptor Kinase Domain
Mol. Mass.:
134279.59
Organism:
Homo sapiens (Human)
Description:
P00533
Residue:
1210
  
Inhibitor
Name:
BDBM4567
Synonyms:
4-anilinoquinazoline deriv. 2 CHEMBL285063 US9422297, PD168393
Type:
Small organic molecule
Emp. Form.:
C17H13BrN4O
Mol. Mass.:
369.215
SMILES:
Brc1cccc(Nc2ncnc3ccc(NC(=O)C=C)cc23)c1
: