Target
Somatostatin receptor type 1
Ligand
BDBM50077280
Substrate
Meas. Tech.
ChEMBL_200668 (CHEMBL806160)
Ki
1400±n/a nM
Citation
 Hocart, SJJain, RMurphy, WATaylor, JECoy, DH Highly potent cyclic disulfide antagonists of somatostatin. J Med Chem 42:1863-71 (1999)  
Target
Name:
Somatostatin receptor type 1
Synonyms:
SOMATOSTATIN SST1 SS-1-R SS1R SSTR1 | Somatostatin receptor type 1 (SSTR1)
Type:
Enzyme
Mol. Mass.:
42692.81
Organism:
Homo sapiens (Human)
Description:
P30872
Residue:
391
  
Inhibitor
Name:
BDBM50077280
Synonyms:
CHEMBL408347 | H-Cpa-cyclo[DCys-Pal-DTrp-Lys-Thr-Cys]-Nal-NH2
Type:
Small organic molecule
Emp. Form.:
C57H67ClN12O9S2
Mol. Mass.:
1163.8
SMILES:
C[C@@H](O)[C@@H]1NC(=O)[C@H](CCCCN)NC(=O)[C@@H](Cc2c[nH]c3ccccc23)NC(=O)[C@@H](Cc2cccnc2)NC(=O)[C@H](CSSC[C@H](NC1=O)C(=O)N[C@@H](Cc1ccc2ccccc2c1)C(N)=O)NC(=O)[C@@H](N)Cc1ccc(Cl)cc1
: