Target
Somatostatin receptor type 1
Ligand
BDBM50077272
Substrate
Meas. Tech.
ChEMBL_200668 (CHEMBL806160)
Ki
>1000±n/a nM
Citation
 Hocart, SJJain, RMurphy, WATaylor, JECoy, DH Highly potent cyclic disulfide antagonists of somatostatin. J Med Chem 42:1863-71 (1999)  
Target
Name:
Somatostatin receptor type 1
Synonyms:
SOMATOSTATIN SST1 SS-1-R SS1R SSTR1 | Somatostatin receptor type 1 (SSTR1)
Type:
Enzyme
Mol. Mass.:
42692.81
Organism:
Homo sapiens (Human)
Description:
P30872
Residue:
391
  
Inhibitor
Name:
BDBM50077272
Synonyms:
CHEMBL412561 | H-DFpa-cyclo[DCys-Pal-DTrp-Lys-Val-Cys]-DFpa-NH2
Type:
Small organic molecule
Emp. Form.:
C54H66F2N12O8S2
Mol. Mass.:
1113.304
SMILES:
CC(C)[C@H]1NC(=O)[C@H](CCCCN)NC(=O)[C@@H](Cc2c[nH]c3ccccc23)NC(=O)[C@H](Cc2cccnc2)NC(=O)[C@H](CSSC[C@@H](NC1=O)C(=O)N[C@H](Cc1ccc(F)cc1)C(N)=O)NC(=O)[C@H](N)Cc1ccc(F)cc1
: