Target
Wee1-like protein kinase
Ligand
BDBM50522504
Substrate
Meas. Tech.
ChEMBL_1886838 (CHEMBL4388515)
Ki
1.000000±n/a nM
Citation
 Mastracchio, ALai, CTorrent, MBromberg, KBuchanan, FGFerguson, DBontcheva, VJohnson, EFLasko, LMaag, DShoemaker, ARPenning, TD Investigation of biaryl heterocycles as inhibitors of Wee1 kinase. Bioorg Med Chem Lett 29:1481-1486 (2019)  
Target
Name:
Wee1-like protein kinase
Synonyms:
Serine/threonine-protein kinase WEE1 WEE1 homolog (S. pombe) | WEE1_HUMAN
Type:
PROTEIN
Mol. Mass.:
71599.12
Organism:
Homo sapiens (Human)
Description:
ChEMBL_1445054
Residue:
646
  
Inhibitor
Name:
BDBM50522504
Synonyms:
CHEMBL4551299
Type:
Small organic molecule
Emp. Form.:
C27H26Cl2N6O
Mol. Mass.:
521.441
SMILES:
CN1CCN(CC1)c1ccc(Nc2ncc3c(n2)n(cc(-c2c(Cl)cccc2Cl)c3=O)C2CC2)cc1
: